Target
E3 ubiquitin-protein ligase Mdm2
Ligand
BDBM50229787
Substrate
Meas. Tech.
ChEMBL_735889 (CHEMBL1694393)
IC50
600±n/a nM
Citation
 Madden, MMMuppidi, ALi, ZLi, XChen, JLin, Q Synthesis of cell-permeable stapled peptide dual inhibitors of the p53-Mdm2/Mdmx interactions via photoinduced cycloaddition. Bioorg Med Chem Lett 21:1472-5 (2011)  
Target
Name:
E3 ubiquitin-protein ligase Mdm2
Synonyms:
Double minute 2 protein E3 ubiquitin-protein ligase Mdm2 (p53-binding protein Mdm2) Human Double Minute 2 (HDM2) MDM2-MDMX p53-Binding Protein MDM2 | p53-binding protein
Type:
Oncoprotein
Mol. Mass.:
55196.54
Organism:
Homo sapiens (Human)
Description:
Q00987
Residue:
491
  
Inhibitor
Name:
BDBM50229787
Synonyms:
(4S,5R)-Nutlin-3 4-((4S,5R)-4,5-bis(4-chlorophenyl)-2-(2-isopropoxy-4-methoxyphenyl)-4,5-dihydro-1H-imidazole-1-carbonyl)piperazin-2-one 4-[(4S,5R)-4,5-Bis-(4-chloro-phenyl)-2-(2-isopropoxy-4-methoxy-phenyl)-4,5-dihydro-imidazole-1-carbonyl]-piperazin-2-one NUTLIN-3 rac-4-(4,5-bis(4-chlorophenyl)-2-(2-isopropoxy-4-methoxyphenyl)-4,5-dihydro-1H-imidazole-1-carbonyl)piperazin-2-one
Type:
Small organic molecule
Emp. Form.:
C30H30Cl2N4O4
Mol. Mass.:
581.49
SMILES:
COc1ccc(C2=N[C@H]([C@H](N2C(=O)N2CCNC(=O)C2)c2ccc(Cl)cc2)c2ccc(Cl)cc2)c(OC(C)C)c1
: