Target
11-beta-hydroxysteroid dehydrogenase 1
Ligand
BDBM50340809
Substrate
Meas. Tech.
ChEMBL_740556 (CHEMBL1764757)
IC50
98±n/a nM
Citation
 Sun, WMaletic, MMundt, SSShah, KZokian, HLyons, KWaddell, STBalkovec, J Substituted phenyl triazoles as selective inhibitors of 11 β-Hydroxysteroid Dehydrogenase Type 1. Bioorg Med Chem Lett 21:2141-5 (2011)  
Target
Name:
11-beta-hydroxysteroid dehydrogenase 1
Synonyms:
11-DH 11-beta-Hydroxysteroid Dehydrogenase 1 (11-beta-HSD1) 11beta-HSD1A Corticosteroid 11-beta-dehydrogenase isozyme 1 (11-beta-HSD-1) Hsd11 | Hsd11b1
Type:
Enzyme
Mol. Mass.:
32369.70
Organism:
Mus musculus (mouse)
Description:
P50172
Residue:
292
  
Inhibitor
Name:
BDBM50340809
Synonyms:
3-Adamantan-1-yl-5,6,7,8,9,10-hexahydro-[1,2,4]triazolo[4,3-a]azocine | CHEMBL256778
Type:
Small organic molecule
Emp. Form.:
C18H27N3
Mol. Mass.:
285.4271
SMILES:
C1C2CC3CC1CC(C2)(C3)c1nnc2CCCCCCn12
: