Target
TGF-beta receptor type-1
Ligand
BDBM50418249
Substrate
Meas. Tech.
ChEMBL_742332 (CHEMBL1768781)
IC50
<10000±n/a nM
Citation
 Medina, JRBecker, CJBlackledge, CWDuquenne, CFeng, YGrant, SWHeerding, DLi, WHMiller, WHRomeril, SPScherzer, DShu, ABobko, MAChadderton, ARDumble, MGardiner, CMGilbert, SLiu, QRabindran, SKSudakin, VXiang, HBrady, PGCampobasso, NWard, PAxten, JM Structure-based design of potent and selective 3-phosphoinositide-dependent kinase-1 (PDK1) inhibitors. J Med Chem 54:1871-95 (2011)  
Target
Name:
TGF-beta receptor type-1
Synonyms:
ALK-5 Activin A receptor type II-like protein kinase of 53kD SKR4 TGF-beta receptor type I TGFBR1 TGFR1_HUMAN Transforming growth factor-beta receptor type I
Type:
enzyme
Mol. Mass.:
55968.24
Organism:
Homo sapiens (Human)
Description:
P36897
Residue:
503
  
Inhibitor
Name:
BDBM50418249
Synonyms:
CHEMBL1765747
Type:
Small organic molecule
Emp. Form.:
C21H28N8O2
Mol. Mass.:
424.4994
SMILES:
CC(C)(C)OC(=O)N[C@H]1CCCN(C1)c1cc(nc(N)n1)-c1ccc2c(N)n[nH]c2c1
: