Target
Aurora kinase B
Ligand
BDBM50418258
Substrate
Meas. Tech.
ChEMBL_742331 (CHEMBL1768780)
IC50
50±n/a nM
Citation
 Medina, JRBecker, CJBlackledge, CWDuquenne, CFeng, YGrant, SWHeerding, DLi, WHMiller, WHRomeril, SPScherzer, DShu, ABobko, MAChadderton, ARDumble, MGardiner, CMGilbert, SLiu, QRabindran, SKSudakin, VXiang, HBrady, PGCampobasso, NWard, PAxten, JM Structure-based design of potent and selective 3-phosphoinositide-dependent kinase-1 (PDK1) inhibitors. J Med Chem 54:1871-95 (2011)  
Target
Name:
Aurora kinase B
Synonyms:
AIK2 AIM1 ARK2 AURKB_HUMAN Aurora B-INCENP Aurora kinase B (AURKB) STK-1 STK12 Serine/threonine-protein kinase aurora B
Type:
Protein
Mol. Mass.:
39327.72
Organism:
Homo sapiens (Human)
Description:
Q96GD4
Residue:
344
  
Inhibitor
Name:
BDBM50418258
Synonyms:
CHEMBL1765749
Type:
Small organic molecule
Emp. Form.:
C22H30N8O2
Mol. Mass.:
438.526
SMILES:
C[C@@H]1CC[C@@H](CN1c1cc(nc(N)n1)-c1ccc2c(N)n[nH]c2c1)NC(=O)OC(C)(C)C
: