Target
Estrogen receptor
Ligand
BDBM50341440
Substrate
Meas. Tech.
ChEMBL_741542 (CHEMBL1769325)
EC50
2300±n/a nM
Citation
 Möcklinghoff, Svan Otterlo, WARose, RFuchs, SZimmermann, TJDominguez Seoane, MWaldmann, HOttmann, CBrunsveld, L Design and evaluation of fragment-like estrogen receptor tetrahydroisoquinoline ligands from a scaffold-detection approach. J Med Chem 54:2005-11 (2011)  
Target
Name:
Estrogen receptor
Synonyms:
ER ESR ESR1_HUMAN Estrogen receptor Estrogen receptor (ER-alpha) Estrogen receptor alpha (ER) Nuclear receptor subfamily 3 group A member 1
Type:
Protein
Mol. Mass.:
66230.44
Organism:
Homo sapiens (Human)
Description:
P03372
Residue:
595
  
Inhibitor
Name:
BDBM50341440
Synonyms:
2-Chloro-2,2-difluoro-1-(6-hydroxy-3,4-dihydroisoquinolin-2(1H)-yl)ethanone | CHEMBL1766974
Type:
Small organic molecule
Emp. Form.:
C11H10ClF2NO2
Mol. Mass.:
261.652
SMILES:
Oc1ccc2CN(CCc2c1)C(=O)C(F)(F)Cl
: