Target
Steroid 17-alpha-hydroxylase/17,20 lyase
Ligand
BDBM50342175
Substrate
Meas. Tech.
ChEMBL_742803 (CHEMBL1769806)
IC50
17±n/a nM
Citation
 Kaku, TTsujimoto, SMatsunaga, NTanaka, THara, TYamaoka, MKusaka, MTasaka, A 17,20-Lyase inhibitors. Part 3: Design, synthesis, and structure-activity relationships of biphenylylmethylimidazole derivatives as novel 17,20-lyase inhibitors. Bioorg Med Chem 19:2428-42 (2011)  
Target
Name:
Steroid 17-alpha-hydroxylase/17,20 lyase
Synonyms:
CP17A_RAT Cyp17a1 Cytochrome P450 17A1 Steroid 17-alpha-hydroxylase/17,20 lyase
Type:
Enzyme
Mol. Mass.:
57255.68
Organism:
Rattus norvegicus (Rat)
Description:
P11715
Residue:
507
  
Inhibitor
Name:
BDBM50342175
Synonyms:
CHEMBL1766176 | rac-N-{4-[1-Hydroxy-1-(1H-imidazol-4-yl)-2-methylpropyl][1,1'-biphenyl]-3-yl}acetamide
Type:
Small organic molecule
Emp. Form.:
C21H23N3O2
Mol. Mass.:
349.4262
SMILES:
CC(C)C(O)(c1cnc[nH]1)c1ccc(cc1)-c1cccc(NC(C)=O)c1
: