Target
Histamine H4 receptor
Ligand
BDBM50343022
Substrate
Meas. Tech.
ChEMBL_744294 (CHEMBL1772151)
Ki
77±n/a nM
Citation
 Meduna, SPSavall, BMCai, HEdwards, JPThurmond, RLMcGovern, PM Triamino pyrimidines and pyridines as histamine H(4) receptor modulators. Bioorg Med Chem Lett 21:3113-6 (2011)  
Target
Name:
Histamine H4 receptor
Synonyms:
AXOR35 GPCR105 HH4R HRH4 Histamine H4 receptor Histamine receptor (H3 and H4) SP9144
Type:
G Protein-Coupled Receptor (GPCR)
Mol. Mass.:
44517.02
Organism:
Homo sapiens (Human)
Description:
Binding assays were using CHO cells stably expressing hH4R receptors.
Residue:
390
  
Inhibitor
Name:
BDBM50343022
Synonyms:
(R)-4-(3-(methylamino)pyrrolidin-1-yl)-6-(pyrrolidin-1-yl)pyridin-2-amine | CHEMBL1770972
Type:
Small organic molecule
Emp. Form.:
C14H23N5
Mol. Mass.:
261.3659
SMILES:
CN[C@@H]1CCN(C1)c1cc(N)nc(c1)N1CCCC1
: