Target
Replicase polyprotein 1ab
Ligand
BDBM50343552
Substrate
Meas. Tech.
ChEMBL_747086 (CHEMBL1777452)
IC50
62790±n/a nM
Citation
 Nguyen, TTRyu, HJLee, SHHwang, SBreton, VRhee, JHKim, D Virtual screening identification of novel severe acute respiratory syndrome 3C-like protease inhibitors and in vitro confirmation. Bioorg Med Chem Lett 21:3088-91 (2011)  
Target
Name:
Replicase polyprotein 1ab
Synonyms:
3C-like proteinase 3C-like proteinase (SARS-CoV 3Cpro) 3CLp GFL Guanine-N7 methyltransferase Helicase Leader protein Non-structural protein 10 Non-structural protein 3 Non-structural protein 6 Non-structural protein 8 ORF1ab polyprotein PL2-PRO Pol R1AB_SARS RdRp SARS coronavirus main proteinase nsp1 nsp12 nsp14 nsp16 nsp3 nsp5 nsp7 nsp9 pp1ab | rep
Type:
Protein
Mol. Mass.:
790250.81
Organism:
Human SARS coronavirus (SARS-CoV) (Severe acute respiratory syndrome coronavirus)
Description:
P0C6X7
Residue:
7073
  
Inhibitor
Name:
BDBM50343552
Synonyms:
1-[2-(dimethylamino)ethyl]-3-hydroxy-5-(4-hydroxy-3-methoxyphenyl)-4-(4-isobutoxy-2-methylbenzoyl)-1,5-dihydro-2H-pyrrol-2-one | CHEMBL1774323
Type:
Small organic molecule
Emp. Form.:
C27H34N2O6
Mol. Mass.:
482.5687
SMILES:
COc1cc(ccc1O)C1C(C(=O)c2ccc(OCC(C)C)cc2C)C(=O)C(=O)N1CCN(C)C
: