Target
Histamine H1 receptor
Ligand
BDBM50343586
Substrate
Meas. Tech.
ChEMBL_745951 (CHEMBL1775250)
IC50
540±n/a nM
Citation
 Kubota, KKurebayashi, HMiyachi, HTobe, MOnishi, MIsobe, Y Synthesis and structure-activity relationship of tricyclic carboxylic acids as novel anti-histamines. Bioorg Med Chem 19:3005-21 (2011)  
Target
Name:
Histamine H1 receptor
Synonyms:
H1R HISTAMINE H1 HRH1_HUMAN
Type:
G Protein-Coupled Receptor (GPCR)
Mol. Mass.:
55808.72
Organism:
Homo sapiens (Human)
Description:
Cell pellets from SK-N-MC cells transfected with human H1 receptor were used in binding assay.
Residue:
487
  
Inhibitor
Name:
BDBM50343586
Synonyms:
(E)-2-(11-(3-(4-(1,3-Dimethyl-2,6-dioxo-1,2,3,6-tetrahydropyrimidin-4-yl)piperazin-1-yl)propylidene)-6,11-dihydrodibenzo[b,e]-oxepin-2-yl)acetic acid | CHEMBL1774501
Type:
Small organic molecule
Emp. Form.:
C29H32N4O5
Mol. Mass.:
516.5882
SMILES:
Cn1c(cc(=O)n(C)c1=O)N1CCN(CC\C=C2/c3ccccc3COc3ccc(CC(O)=O)cc23)CC1
: