Target
Melatonin receptor type 1B
Ligand
BDBM50343595
Substrate
Meas. Tech.
ChEMBL_746050 (CHEMBL1775437)
Ki
0.009±n/a nM
Citation
 Koike, THoashi, YTakai, TNakayama, MYukuhiro, NIshikawa, THirai, KUchikawa, O 1,6-Dihydro-2H-indeno[5,4-b]furan derivatives: design, synthesis, and pharmacological characterization of a novel class of highly potent MT2-selective agonists. J Med Chem 54:3436-44 (2011)  
Target
Name:
Melatonin receptor type 1B
Synonyms:
MTNR1B Mel-1B-R Melatonin 1B Melatonin receptor type 1B | Melatonin receptor type 2 (MT2)
Type:
Enzyme
Mol. Mass.:
40203.54
Organism:
Homo sapiens (Human)
Description:
P49286
Residue:
362
  
Inhibitor
Name:
BDBM50343595
Synonyms:
CHEMBL1774526 | N-{2-[7-(3-Methoxyphenyl)-1,6-dihydro-2H-indeno[5,4-b]-furan-8-yl]ethyl}acetamide
Type:
Small organic molecule
Emp. Form.:
C22H23NO3
Mol. Mass.:
349.4229
SMILES:
COc1cccc(c1)C1=C(CCNC(C)=O)c2c(C1)ccc1OCCc21
: