Target
Melatonin receptor type 1B
Ligand
BDBM50343604
Substrate
Meas. Tech.
ChEMBL_746050 (CHEMBL1775437)
Ki
0.084±n/a nM
Citation
 Koike, THoashi, YTakai, TNakayama, MYukuhiro, NIshikawa, THirai, KUchikawa, O 1,6-Dihydro-2H-indeno[5,4-b]furan derivatives: design, synthesis, and pharmacological characterization of a novel class of highly potent MT2-selective agonists. J Med Chem 54:3436-44 (2011)  
Target
Name:
Melatonin receptor type 1B
Synonyms:
MTNR1B Mel-1B-R Melatonin 1B Melatonin receptor type 1B | Melatonin receptor type 2 (MT2)
Type:
Enzyme
Mol. Mass.:
40203.54
Organism:
Homo sapiens (Human)
Description:
P49286
Residue:
362
  
Inhibitor
Name:
BDBM50343604
Synonyms:
CHEMBL1774517 | N-Ethyl-N'-[2-(7-isopropyl-1,6-dihydro-2H-indeno[5,4-b]-furan-8-yl)ethyl]urea
Type:
Small organic molecule
Emp. Form.:
C19H26N2O2
Mol. Mass.:
314.4219
SMILES:
CCNC(=O)NCCC1=C(Cc2ccc3OCCc3c12)C(C)C
: