Target
Melatonin receptor type 1A
Ligand
BDBM50343608
Substrate
Meas. Tech.
ChEMBL_746047 (CHEMBL1775434)
Ki
0.024±n/a nM
Citation
 Koike, THoashi, YTakai, TNakayama, MYukuhiro, NIshikawa, THirai, KUchikawa, O 1,6-Dihydro-2H-indeno[5,4-b]furan derivatives: design, synthesis, and pharmacological characterization of a novel class of highly potent MT2-selective agonists. J Med Chem 54:3436-44 (2011)  
Target
Name:
Melatonin receptor type 1A
Synonyms:
MTNR1A MTR1A_HUMAN Mel1a melatonin receptor Melatonin receptor Melatonin receptor type 1 (MT1) | Melatonin receptor type 1A
Type:
Enzyme
Mol. Mass.:
39392.94
Organism:
Homo sapiens (Human)
Description:
P48039
Residue:
350
  
Inhibitor
Name:
BDBM50343608
Synonyms:
CHEMBL1774513 | N-[2-(7-Isopropyl-1,6-dihydro-2H-indeno[5,4-b]furan-8-yl)-ethyl]acetamide
Type:
Small organic molecule
Emp. Form.:
C18H23NO2
Mol. Mass.:
285.3807
SMILES:
CC(C)C1=C(CCNC(C)=O)c2c(C1)ccc1OCCc21
: