Target
5-hydroxytryptamine receptor 1A
Ligand
BDBM50346381
Substrate
Meas. Tech.
ChEMBL_749999 (CHEMBL1787137)
Ki
>10000±n/a nM
Citation
 Fiorino, FMagli, EPerissutti, ESeverino, BFrecentese, FEsposito, ADe Angelis, FIncisivo, GMMassarelli, PNencini, CDi Gennaro, EBudillon, ADi Cintio, ASantagada, VCaliendo, G Synthesis of 1-naphtylpiperazine derivatives as serotoninergic ligands and their evaluation as antiproliferative agents. Eur J Med Chem 46:2206-16 (2011)  
Target
Name:
5-hydroxytryptamine receptor 1A
Synonyms:
5-HT-1A 5-HT1A 5-hydroxytryptamine receptor 1A (5HT1A) 5ht1a Htr1a Serotonin 1a (5-HT1a) receptor/Adrenergic receptor alpha-1 | Serotonin receptor 1A
Type:
G Protein-Coupled Receptor (GPCR)
Mol. Mass.:
46445.29
Organism:
Rattus norvegicus (rat)
Description:
Binding assays were performed using rat hippocampal membranes.
Residue:
422
  
Inhibitor
Name:
BDBM50346381
Synonyms:
CHEMBL1783352 | N'-cyano-N-(3-(4-(naphthalen-1-yl)piperazin-1-yl)propyl)isonicotinamidine
Type:
Small organic molecule
Emp. Form.:
C24H26N6
Mol. Mass.:
398.5034
SMILES:
N#CNC(=NCCCN1CCN(CC1)c1cccc2ccccc12)c1ccncc1
: