Target
D(1A) dopamine receptor
Ligand
BDBM50346376
Substrate
Meas. Tech.
ChEMBL_749997 (CHEMBL1787135)
Ki
>10000±n/a nM
Citation
 Fiorino, FMagli, EPerissutti, ESeverino, BFrecentese, FEsposito, ADe Angelis, FIncisivo, GMMassarelli, PNencini, CDi Gennaro, EBudillon, ADi Cintio, ASantagada, VCaliendo, G Synthesis of 1-naphtylpiperazine derivatives as serotoninergic ligands and their evaluation as antiproliferative agents. Eur J Med Chem 46:2206-16 (2011)  
Target
Name:
D(1A) dopamine receptor
Synonyms:
DOPAMINE D1 Dopamine D1 high Dopamine receptor Dopamine1-like Drd1a
Type:
Enzyme Catalytic Domain
Mol. Mass.:
49429.75
Organism:
RAT
Description:
P18901
Residue:
446
  
Inhibitor
Name:
BDBM50346376
Synonyms:
3-(3-(4-(naphthalen-1-yl)piperazin-1-yl)propyl)benzo[d][1,2,3]triazin-4(3H)-one | CHEMBL1783347
Type:
Small organic molecule
Emp. Form.:
C24H25N5O
Mol. Mass.:
399.4882
SMILES:
O=c1n(CCCN2CCN(CC2)c2cccc3ccccc23)nnc2ccccc12
: