Target
D(1A) dopamine receptor
Ligand
BDBM50346381
Substrate
Meas. Tech.
ChEMBL_749997 (CHEMBL1787135)
Ki
>10000±n/a nM
Citation
 Fiorino, FMagli, EPerissutti, ESeverino, BFrecentese, FEsposito, ADe Angelis, FIncisivo, GMMassarelli, PNencini, CDi Gennaro, EBudillon, ADi Cintio, ASantagada, VCaliendo, G Synthesis of 1-naphtylpiperazine derivatives as serotoninergic ligands and their evaluation as antiproliferative agents. Eur J Med Chem 46:2206-16 (2011)  
Target
Name:
D(1A) dopamine receptor
Synonyms:
DOPAMINE D1 Dopamine D1 high Dopamine receptor Dopamine1-like Drd1a
Type:
Enzyme Catalytic Domain
Mol. Mass.:
49429.75
Organism:
RAT
Description:
P18901
Residue:
446
  
Inhibitor
Name:
BDBM50346381
Synonyms:
CHEMBL1783352 | N'-cyano-N-(3-(4-(naphthalen-1-yl)piperazin-1-yl)propyl)isonicotinamidine
Type:
Small organic molecule
Emp. Form.:
C24H26N6
Mol. Mass.:
398.5034
SMILES:
N#CNC(=NCCCN1CCN(CC1)c1cccc2ccccc12)c1ccncc1
: