Target
5-hydroxytryptamine receptor 2A
Ligand
BDBM21395
Substrate
Meas. Tech.
ChEMBL_749761 (CHEMBL1787921)
Ki
0.85±n/a nM
Citation
 Fiorino, FMagli, EPerissutti, ESeverino, BFrecentese, FEsposito, ADe Angelis, FIncisivo, GMMassarelli, PNencini, CDi Gennaro, EBudillon, ADi Cintio, ASantagada, VCaliendo, G Synthesis of 1-naphtylpiperazine derivatives as serotoninergic ligands and their evaluation as antiproliferative agents. Eur J Med Chem 46:2206-16 (2011)  
Target
Name:
5-hydroxytryptamine receptor 2A
Synonyms:
5-HT-2A 5-HT2A 5-hydroxytryptamine receptor 2A (5HT2A) Htr2 Serotonin Receptor 2A
Type:
G Protein-Coupled Receptor (GPCR)
Mol. Mass.:
52852.05
Organism:
Rattus norvegicus (rat)
Description:
Rat cortex membranes 5-HT2A receptors.
Residue:
471
  
Inhibitor
Name:
BDBM21395
Synonyms:
3-(2-(4-(4-Fluorobenzoyl)piperidinol)ethyl)-2,4(1H,3H)-quinazolinedione CHEMBL1628637 Ketanserin R-41-468 [3H]-Ketanserin
Type:
radiolabeled ligand
Emp. Form.:
C22H22FN3O3
Mol. Mass.:
395.4268
SMILES:
Fc1ccc(cc1)C(=O)C1CCN(CCn2c(=O)[nH]c3ccccc3c2=O)CC1
: