Target
Matrix metalloproteinase-25
Ligand
BDBM50346800
Substrate
Meas. Tech.
ChEMBL_753772 (CHEMBL1799653)
IC50
76±n/a nM
Citation
 Nuti, ECasalini, FSantamaria, SGabelloni, PBendinelli, SDa Pozzo, ECosta, BMarinelli, LLa Pietra, VNovellino, EMargarida Bernardo, MFridman, RDa Settimo, FMartini, CRossello, A Synthesis and biological evaluation in U87MG glioma cells of (ethynylthiophene)sulfonamido-based hydroxamates as matrix metalloproteinase inhibitors. Eur J Med Chem 46:2617-29 (2011)  
Target
Name:
Matrix metalloproteinase-25
Synonyms:
Leukolysin MMP20 MMP25_HUMAN MT-MMP 6 MT6MMP Matrix metalloproteinase-25 Membrane-type-6 matrix metalloproteinase | Membrane-type-6 matrix metalloproteinase (MT6-MMP)
Type:
Protein
Mol. Mass.:
62564.84
Organism:
Homo sapiens (Human)
Description:
Q9NPA2
Residue:
562
  
Inhibitor
Name:
BDBM50346800
Synonyms:
CHEMBL1795859
Type:
Small organic molecule
Emp. Form.:
C27H27N3O4S2
Mol. Mass.:
521.651
SMILES:
CCCCc1ccc(cc1)C#Cc1ccc(s1)S(=O)(=O)N[C@H](Cc1c[nH]c2ccccc12)C(=O)NO
: