Target
Cannabinoid receptor 1
Ligand
BDBM50347370
Substrate
Meas. Tech.
ChEMBL_755296 (CHEMBL1804296)
Ki
0.29±n/a nM
Citation
 Bodmer-Narkevitch, VAnthony, NJCofre, VJolly, SMMurphy, KLRansom, RWReiss, DRTang, CPrueksaritanont, TPettibone, DJBock, MGKuduk, SD Indazole derivatives as novel bradykinin B1 receptor antagonists. Bioorg Med Chem Lett 20:7011-4 (2010)  
Target
Name:
Cannabinoid receptor 1
Synonyms:
CANN6 CB-R CNR CNR1_HUMAN Cannabinoid receptor Cannabinoid receptor 1 (brain)
Type:
G Protein-Coupled Receptor (GPCR)
Mol. Mass.:
52868.96
Organism:
Homo sapiens (Human)
Description:
P21554
Residue:
472
  
Inhibitor
Name:
BDBM50347370
Synonyms:
CHEMBL1801087
Type:
Small organic molecule
Emp. Form.:
C24H21ClFN5O3S
Mol. Mass.:
513.972
SMILES:
COc1ncc(s1)C(=O)NC1(CC1)C(=O)N[C@H](C)c1ccc(cc1F)-n1nc(Cl)c2ccccc12
: