Target
Cannabinoid receptor 1
Ligand
BDBM50347378
Substrate
Meas. Tech.
ChEMBL_755296 (CHEMBL1804296)
Ki
0.37±n/a nM
Citation
 Bodmer-Narkevitch, VAnthony, NJCofre, VJolly, SMMurphy, KLRansom, RWReiss, DRTang, CPrueksaritanont, TPettibone, DJBock, MGKuduk, SD Indazole derivatives as novel bradykinin B1 receptor antagonists. Bioorg Med Chem Lett 20:7011-4 (2010)  
Target
Name:
Cannabinoid receptor 1
Synonyms:
CANN6 CB-R CNR CNR1_HUMAN Cannabinoid receptor Cannabinoid receptor 1 (brain)
Type:
G Protein-Coupled Receptor (GPCR)
Mol. Mass.:
52868.96
Organism:
Homo sapiens (Human)
Description:
P21554
Residue:
472
  
Inhibitor
Name:
BDBM50347378
Synonyms:
CHEMBL1801348
Type:
Small organic molecule
Emp. Form.:
C25H20ClF2N5O2
Mol. Mass.:
495.908
SMILES:
C[C@@H](NC(=O)C1(CC1)NC(=O)c1cncc(F)c1)c1ccc(cc1F)-n1nc(Cl)c2ccccc12
: