Target
Protein-S-isoprenylcysteine O-methyltransferase
Ligand
BDBM50348014
Substrate
Meas. Tech.
ChEMBL_757250 (CHEMBL1803626)
IC50
>1000±n/a nM
Citation
 Judd, WRSlattum, PMHoang, KCBhoite, LValppu, LAlberts, GBrown, BRoth, BOstanin, KHuang, LWettstein, DRichards, BWillardsen, JA Discovery and SAR of methylated tetrahydropyranyl derivatives as inhibitors of isoprenylcysteine carboxyl methyltransferase (ICMT). J Med Chem 54:5031-47 (2011)  
Target
Name:
Protein-S-isoprenylcysteine O-methyltransferase
Synonyms:
ICMT Isoprenylcysteine carboxyl methyltransferase | PCCMT
Type:
PROTEIN
Mol. Mass.:
31943.26
Organism:
Homo sapiens (Human)
Description:
ChEMBL_956034
Residue:
284
  
Inhibitor
Name:
BDBM50348014
Synonyms:
CHEMBL1800411
Type:
Small organic molecule
Emp. Form.:
C20H23FN2OS
Mol. Mass.:
358.473
SMILES:
CC1(C)CC(CCO1)(NC(=S)Nc1cccc(F)c1)c1ccccc1
: