Target
Cannabinoid receptor 1
Ligand
BDBM50348135
Substrate
Meas. Tech.
ChEMBL_757147 (CHEMBL1803287)
Ki
>2000±n/a nM
Citation
 Martín-Couce, LMartín-Fontecha, MCapolicchio, SLópez-Rodríguez, MLOrtega-Gutiérrez, S Development of endocannabinoid-based chemical probes for the study of cannabinoid receptors. J Med Chem 54:5265-9 (2011)  
Target
Name:
Cannabinoid receptor 1
Synonyms:
CANN6 CB-R CNR CNR1_HUMAN Cannabinoid receptor Cannabinoid receptor 1 (brain)
Type:
G Protein-Coupled Receptor (GPCR)
Mol. Mass.:
52868.96
Organism:
Homo sapiens (Human)
Description:
P21554
Residue:
472
  
Inhibitor
Name:
BDBM50348135
Synonyms:
CHEMBL1800181
Type:
Small organic molecule
Emp. Form.:
C38H60N4O5S
Mol. Mass.:
684.972
SMILES:
O=C(CCCC[C@@H]1SC[C@@H]2NC(=O)N[C@H]12)NCCCCCC(=O)OCCCC\C=C/C\C=C/C\C=C/C\C=C/CCCC(=O)NC1CC1
: