Target
Cannabinoid receptor 2
Ligand
BDBM50350161
Substrate
Meas. Tech.
ChEMBL_761451 (CHEMBL1817172)
Ki
0.2±n/a nM
Citation
 Pasquini, SDe Rosa, MPedani, VMugnaini, CGuida, FLuongo, LDe Chiaro, MMaione, SDragoni, SFrosini, MLigresti, ADi Marzo, VCorelli, F Investigations on the 4-quinolone-3-carboxylic acid motif. 4. Identification of new potent and selective ligands for the cannabinoid type 2 receptor with diverse substitution patterns and antihyperalgesic effects in mice. J Med Chem 54:5444-53 (2011)  
Target
Name:
Cannabinoid receptor 2
Synonyms:
CANNABINOID CB2 CB2 CB2B CNR2_HUMAN Cannabinoid CB2 receptor Cannabinoid receptor 2 (CB2R) | hCB2
Type:
G Protein-Coupled Receptor (GPCR)
Mol. Mass.:
39690.94
Organism:
Homo sapiens (Human)
Description:
P34972
Residue:
360
  
Inhibitor
Name:
BDBM50350161
Synonyms:
CHEMBL1814468
Type:
Small organic molecule
Emp. Form.:
C25H32N2O2
Mol. Mass.:
392.5338
SMILES:
CCCCCn1c2ccccc2cc(C(=O)NC23CC4CC(CC(C4)C2)C3)c1=O
: