Target
Bifunctional epoxide hydrolase 2
Ligand
BDBM25732
Substrate
Meas. Tech.
ChEMBL_763895 (CHEMBL1819920)
IC50
2±n/a nM
Citation
 Brown, JRNorth, EJHurdle, JGMorisseau, CScarborough, JSSun, DKorduláková, JScherman, MSJones, VGrzegorzewicz, ACrew, RMJackson, MMcNeil, MRLee, RE The structure-activity relationship of urea derivatives as anti-tuberculosis agents. Bioorg Med Chem 19:5585-95 (2011)  
Target
Name:
Bifunctional epoxide hydrolase 2
Synonyms:
Cytosolic epoxide hydrolase 2 EPHX2 HYES_HUMAN Soluble epoxide hydrolase (sEH) | epoxide hydrolase 2, cytoplasmic
Type:
Enzyme
Mol. Mass.:
62613.07
Organism:
Homo sapiens (Human)
Description:
P34913
Residue:
555
  
Inhibitor
Name:
BDBM25732
Synonyms:
3-adamantan-1-yl-1-cyclohexylurea US8815951, 192 | Urea-based compound, 13
Type:
Small organic molecule
Emp. Form.:
C17H28N2O
Mol. Mass.:
276.417
SMILES:
O=C(NC1CCCCC1)NC12CC3CC(CC(C3)C1)C2
: