Target
Transcriptional activator protein TraR
Ligand
BDBM50351509
Substrate
Meas. Tech.
ChEMBL_765233 (CHEMBL1827786)
IC50
1050±n/a nM
Citation
 Lowery, CASalzameda, NTSawada, DKaufmann, GFJanda, KD Medicinal chemistry as a conduit for the modulation of quorum sensing. J Med Chem 53:7467-89 (2010)  
Target
Name:
Transcriptional activator protein TraR
Synonyms:
TRAR_RHIRD | traR
Type:
PROTEIN
Mol. Mass.:
26741.83
Organism:
Rhizobium radiobacter
Description:
ChEMBL_765233
Residue:
234
  
Inhibitor
Name:
BDBM50351509
Synonyms:
CHEMBL8799
Type:
Small organic molecule
Emp. Form.:
C14H25NO3
Mol. Mass.:
255.3532
SMILES:
CCCCCCCCCC(=O)N[C@H]1CCOC1=O
: