Target
Epidermal growth factor receptor
Ligand
BDBM50352219
Substrate
Meas. Tech.
ChEMBL_766557 (CHEMBL1827038)
IC50
1840±n/a nM
Citation
 Lv, PCLi, DDLi, QSLu, XXiao, ZPZhu, HL Synthesis, molecular docking and evaluation of thiazolyl-pyrazoline derivatives as EGFR TK inhibitors and potential anticancer agents. Bioorg Med Chem Lett 21:5374-7 (2011)  
Target
Name:
Epidermal growth factor receptor
Synonyms:
EGF Receptor Substrate EGFR_HUMAN ERBB1 Epidermal Growth Factor Receptor erbB-1 Epidermal growth factor receptor (EGFR) HER1 Proto-oncogene c-ErbB-1 Tyrosine-Protein Kinase ErbB-1
Type:
Receptor Kinase Domain
Mol. Mass.:
134279.59
Organism:
Homo sapiens (Human)
Description:
P00533
Residue:
1210
  
Inhibitor
Name:
BDBM50352219
Synonyms:
CHEMBL1821864
Type:
Small organic molecule
Emp. Form.:
C26H22BrN3S
Mol. Mass.:
488.442
SMILES:
Cc1ccc(cc1C)C1=NN(C(C1)c1ccc(Br)cc1)c1nc(cs1)-c1ccccc1
: