Target
Acetylcholine receptor subunit alpha
Ligand
BDBM50352790
Substrate
Meas. Tech.
ChEMBL_767064 (CHEMBL1828495)
IC50
>10000±n/a nM
Citation
 Simoni, DRondanin, RMarchetti, PRullo, CBaruchello, RGrisolia, GBarbato, GGiovannini, RMarchioro, CCapelli, AMVirginio, CBozzoli, ABorea, PAMerighi, SDonati, D Synthesis and biological activity of a novel class nicotinic acetylcholine receptors (nAChRs) ligands structurally related to anatoxin-a. Bioorg Med Chem Lett 21:5423-7 (2011)  
Target
Name:
Acetylcholine receptor subunit alpha
Synonyms:
ACHA_HUMAN Acetylcholine receptor protein alpha chain CHNRA Cholinergic, Nicotinic Alpha1Beta1DeltaGamma Nicotinic acetylcholine receptor alpha-1/beta-1 Nicotinic acetylcholine receptor alpha2/beta4 n-AChR
Type:
Ion channel
Mol. Mass.:
54542.01
Organism:
Homo sapiens (Human)
Description:
Residue:
482
  
Inhibitor
Name:
BDBM50352790
Synonyms:
CHEMBL1823386
Type:
Small organic molecule
Emp. Form.:
C10H14N2O
Mol. Mass.:
178.231
SMILES:
Cc1noc2CC[C@@H]3CC[C@@H](N3)c12
: