Target
Histone deacetylase 4
Ligand
BDBM50248476
Substrate
Meas. Tech.
ChEMBL_769060 (CHEMBL1832523)
Ki
8.5±n/a nM
Citation
 Wang, HYu, NChen, DLee, KCLye, PLChang, JWDeng, WNg, MCLu, TKhoo, MLPoulsen, ASangthongpitag, KWu, XHu, CGoh, KCWang, XFang, LGoh, KLKhng, HHGoh, SKYeo, PLiu, XBonday, ZWood, JMDymock, BWKantharaj, ESun, ET Discovery of (2E)-3-{2-butyl-1-[2-(diethylamino)ethyl]-1H-benzimidazol-5-yl}-N-hydroxyacrylamide (SB939), an orally active histone deacetylase inhibitor with a superior preclinical profile. J Med Chem 54:4694-720 (2011)  
Target
Name:
Histone deacetylase 4
Synonyms:
Cereblon/Histone deacetylase 4 HDAC4 Histone acetylase 4(HDAC4) KIAA0288
Type:
Enzyme
Mol. Mass.:
119049.39
Organism:
Homo sapiens (Human)
Description:
P56524
Residue:
1084
  
Inhibitor
Name:
BDBM50248476
Synonyms:
CHEMBL491316 N-hydroxy-3-[2-phenethyl-1-(2-pyrrolidin-1-ylethyl)-1H-benzimidazol-5-yl]acrylamide US10201527, Compound 72 US8551988, 72
Type:
Small organic molecule
Emp. Form.:
C24H28N4O2
Mol. Mass.:
404.5047
SMILES:
ONC(=O)\C=C\c1ccc2n(CCN3CCCC3)c(CCc3ccccc3)nc2c1
: