Target
Cytochrome P450 26A1
Ligand
BDBM50353582
Substrate
Meas. Tech.
ChEMBL_769532 (CHEMBL1833279)
IC50
0.35±n/a nM
Citation
 Gomaa, MSBridgens, CEVeal, GJRedfern, CPBrancale, AArmstrong, JLSimons, C Synthesis and biological evaluation of 3-(1H-imidazol- and triazol-1-yl)-2,2-dimethyl-3-[4-(naphthalen-2-ylamino)phenyl]propyl derivatives as small molecule inhibitors of retinoic acid 4-hydroxylase (CYP26). J Med Chem 54:6803-11 (2011)  
Target
Name:
Cytochrome P450 26A1
Synonyms:
CP26A_HUMAN CYP26A1 Cytochrome P450 26A1 P450RAI1 | Retinoic acid 4-hydroxylase
Type:
Enzyme
Mol. Mass.:
56216.16
Organism:
Homo sapiens (Human)
Description:
O43174
Residue:
497
  
Inhibitor
Name:
BDBM50353582
Synonyms:
CHEMBL1831083
Type:
Small organic molecule
Emp. Form.:
C26H27N3O2
Mol. Mass.:
413.5115
SMILES:
CCOC(=O)C(C)(C)C(c1ccc(Nc2ccc3ccccc3c2)cc1)n1ccnc1
: