Target
Bromodomain adjacent to zinc finger domain protein 2B
Ligand
BDBM50353587
Substrate
Meas. Tech.
ChEMBL_770208 (CHEMBL1832998)
IC50
34000000±n/a nM
Citation
 Hewings, DSWang, MPhilpott, MFedorov, OUttarkar, SFilippakopoulos, PPicaud, SVuppusetty, CMarsden, BKnapp, SConway, SJHeightman, TD 3,5-dimethylisoxazoles act as acetyl-lysine-mimetic bromodomain ligands. J Med Chem 54:6761-70 (2011)  
Target
Name:
Bromodomain adjacent to zinc finger domain protein 2B
Synonyms:
BAZ2B KIAA1476 | hWALp4
Type:
PROTEIN
Mol. Mass.:
240455.43
Organism:
Homo sapiens (Human)
Description:
ChEMBL_1498197
Residue:
2168
  
Inhibitor
Name:
BDBM50353587
Synonyms:
CHEMBL12543
Type:
Small organic molecule
Emp. Form.:
C5H9NO
Mol. Mass.:
99.1311
SMILES:
CN1CCCC1=O
: