Target
Amine oxidase [flavin-containing] B
Ligand
BDBM74900
Substrate
Meas. Tech.
ChEMBL_769479 (CHEMBL1833115)
IC50
15400±n/a nM
Citation
 Secci, DCarradori, SBolasco, AChimenti, PYáñez, MOrtuso, FAlcaro, S Synthesis and selective human monoamine oxidase inhibition of 3-carbonyl, 3-acyl, and 3-carboxyhydrazido coumarin derivatives. Eur J Med Chem 46:4846-52 (2011)  
Target
Name:
Amine oxidase [flavin-containing] B
Synonyms:
AOFB_HUMAN MAOB Monoamine oxidase type B (MAO B) Monoamine oxidase type B (MAOB)
Type:
Protein
Mol. Mass.:
58768.76
Organism:
Homo sapiens (Human)
Description:
P27338
Residue:
520
  
Inhibitor
Name:
BDBM74900
Synonyms:
3-acetyl-7-methoxy-1-benzopyran-2-one 3-acetyl-7-methoxy-coumarin 3-ethanoyl-7-methoxy-chromen-2-one SMR000268215 | cid_2054475
Type:
Small organic molecule
Emp. Form.:
C12H10O4
Mol. Mass.:
218.2054
SMILES:
COc1ccc2cc(C(C)=O)c(=O)oc2c1
: