Target
Sodium-dependent noradrenaline transporter
Ligand
BDBM35229
Substrate
Meas. Tech.
ChEMBL_769842 (CHEMBL1831836)
Ki
2.1±n/a nM
Citation
 O'Neill, DJAdedoyin, ABray, JADeecher, DCFensome, AGoldberg, JAHarrison, JLeventhal, LMann, CMark, LNogle, LSullivan, NRSpangler, TBTerefenko, EATrybulski, EJUveges, AJVu, AWhiteside, GTZhang, P Discovery of novel selective norepinephrine inhibitors: 1-(2-morpholin-2-ylethyl)-3-aryl-1,3-dihydro-2,1,3-benzothiadiazole 2,2-dioxides (WYE-114152). J Med Chem 54:6824-31 (2011)  
Target
Name:
Sodium-dependent noradrenaline transporter
Synonyms:
Monoamine transporter NET Noradrenaline Transporter (NET) Norepinephrine transporter protein (NET) SLC6A2 Sodium-dependent noradrenaline transporter (NET) | Solute carrier family 6 member 2
Type:
Multi-pass membrane protein
Mol. Mass.:
69337.72
Organism:
Homo sapiens (Human)
Description:
P23975
Residue:
617
  
Inhibitor
Name:
BDBM35229
Synonyms:
3-(10,11-dihydro-5H-dibenzo[b,f]azepin-5-yl)-N-methylpropan-1-amine CHEMBL72 DMI Desipramine N-(3-methylaminopropyl)iminobibenzyl demethylimipramine norimipramine
Type:
Small organic molecule
Emp. Form.:
C18H22N2
Mol. Mass.:
266.3807
SMILES:
CNCCCN1c2ccccc2CCc2ccccc12
: