Target
Carbonic anhydrase 12
Ligand
BDBM50354346
Substrate
Meas. Tech.
ChEMBL_770798 (CHEMBL1837603)
Ki
8.9±n/a nM
Citation
 Morris, JCChiche, JGrellier, CLopez, MBornaghi, LFMaresca, ASupuran, CTPouysségur, JPoulsen, SA Targeting hypoxic tumor cell viability with carbohydrate-based carbonic anhydrase IX and XII inhibitors. J Med Chem 54:6905-18 (2011)  
Target
Name:
Carbonic anhydrase 12
Synonyms:
CA-XII CAH12_HUMAN Carbonic anhydrase Carbonic anhydrase XII Carbonic anhydrase XII (CAXII) | Tumor antigen HOM-RCC-3.1.3
Type:
Enzyme
Mol. Mass.:
39456.00
Organism:
Homo sapiens (Human)
Description:
Catalytic domain of human cloned isozyme was used in the assay
Residue:
354
  
Inhibitor
Name:
BDBM50354346
Synonyms:
CHEMBL1836623
Type:
Small organic molecule
Emp. Form.:
C23H27IN4O11S2
Mol. Mass.:
726.515
SMILES:
CC(=O)OC[C@H]1O[C@@H](SCc2nnn(c2I)-c2ccc(cc2)S(N)(=O)=O)[C@H](OC(C)=O)[C@@H](OC(C)=O)[C@H]1OC(C)=O
: