Target
Carbonic anhydrase 9
Ligand
BDBM50354347
Substrate
Meas. Tech.
ChEMBL_770797 (CHEMBL1837602)
Ki
6.2±n/a nM
Citation
 Morris, JCChiche, JGrellier, CLopez, MBornaghi, LFMaresca, ASupuran, CTPouysségur, JPoulsen, SA Targeting hypoxic tumor cell viability with carbohydrate-based carbonic anhydrase IX and XII inhibitors. J Med Chem 54:6905-18 (2011)  
Target
Name:
Carbonic anhydrase 9
Synonyms:
CA-IX CAH9_HUMAN Carbonic anhydrase 9 (CA IX) Carbonic anhydrase 9 precursor Carbonic anhydrase IX (CAIX) Carbonic anhydrases; II & IX MN RCC-associated antigen G250
Type:
Enzyme
Mol. Mass.:
49669.03
Organism:
Homo sapiens (Human)
Description:
Catalytic domain of human cloned isozyme was used in the assay
Residue:
459
  
Inhibitor
Name:
BDBM50354347
Synonyms:
CHEMBL1836622
Type:
Small organic molecule
Emp. Form.:
C23H27IN4O11S2
Mol. Mass.:
726.515
SMILES:
CC(=O)OC[C@H]1O[C@@H](SCc2nnn(c2I)-c2ccc(cc2)S(N)(=O)=O)[C@H](OC(C)=O)[C@@H](OC(C)=O)[C@@H]1OC(C)=O
: