Target
Prostaglandin G/H synthase 2
Ligand
BDBM50355028
Substrate
Meas. Tech.
ChEMBL_772567 (CHEMBL1839542)
IC50
>100000±n/a nM
Citation
 Abdur Rahim, MPraveen Rao, PNBhardwaj, AKaur, JHuang, ZKnaus, EE Isomeric acetoxy analogs of celecoxib and their evaluation as cyclooxygenase inhibitors. Bioorg Med Chem Lett 21:6074-80 (2011)  
Target
Name:
Prostaglandin G/H synthase 2
Synonyms:
COX2 Cyclooxygenase-2 (COX-2) PTGS2 Prostaglandin G/H synthase (cyclooxygenase)
Type:
Protein
Mol. Mass.:
68976.98
Organism:
Ovis aries (Sheep)
Description:
Residue:
603
  
Inhibitor
Name:
BDBM50355028
Synonyms:
CHEMBL1835472
Type:
Small organic molecule
Emp. Form.:
C18H14F3N3O4S
Mol. Mass.:
425.382
SMILES:
CC(=O)Oc1ccccc1-c1cc(nn1-c1ccc(cc1)S(N)(=O)=O)C(F)(F)F
: