Target
Kallikrein-7
Ligand
BDBM50355086
Substrate
Meas. Tech.
ChEMBL_772792 (CHEMBL1837531)
IC50
112400±n/a nM
Citation
 Teixeira, TSFreitas, RFAbrahão, ODevienne, KFde Souza, LRBlaber, SIBlaber, MKondo, MYJuliano, MAJuliano, LPuzer, L Biological evaluation and docking studies of natural isocoumarins as inhibitors for human kallikrein 5 and 7. Bioorg Med Chem Lett 21:6112-5 (2011)  
Target
Name:
Kallikrein-7
Synonyms:
KLK7 Kallikrein 7 PRSS6 Serine protease 6 hK7 kallikrein-7 isoform 1 preproprotein
Type:
PROTEIN
Mol. Mass.:
27535.05
Organism:
Homo sapiens (Human)
Description:
ChEMBL_1469257
Residue:
253
  
Inhibitor
Name:
BDBM50355086
Synonyms:
CHEMBL1834753
Type:
Small organic molecule
Emp. Form.:
C32H26O12
Mol. Mass.:
602.5416
SMILES:
COc1cc2c(OC)c3cc(C)oc(=O)c3c(O)c2c(O)c1-c1c(OC)cc2c(OC)c3cc(C)oc(=O)c3c(O)c2c1O
: