Target
Receptor-type tyrosine-protein kinase FLT3
Ligand
BDBM50355467
Substrate
Meas. Tech.
ChEMBL_773456 (CHEMBL1840408)
Ki
6±n/a nM
Citation
 Davies, RJPierce, ACForster, CGrey, RXu, JArnost, MChoquette, DGalullo, VTian, SKHenkel, GChen, GHeidary, DKMa, JStuver-Moody, CNamchuk, M Design, synthesis, and evaluation of a novel dual FMS-like tyrosine kinase 3/stem cell factor receptor (FLT3/c-KIT) inhibitor for the treatment of acute myelogenous leukemia. J Med Chem 54:7184-92 (2011)  
Target
Name:
Receptor-type tyrosine-protein kinase FLT3
Synonyms:
CD135 FL cytokine receptor FLK2 FLT3 Fetal liver kinase-2 Fms-like tyrosine kinase 3 (Flt-3) STK-1 Stem cell tyrosine kinase 1
Type:
Enzyme
Mol. Mass.:
112888.62
Organism:
Homo sapiens (Human)
Description:
P36888
Residue:
993
  
Inhibitor
Name:
BDBM50355467
Synonyms:
CHEMBL1833992
Type:
Small organic molecule
Emp. Form.:
C18H21N7O2
Mol. Mass.:
367.405
SMILES:
COc1ccc(cc1Nc1nc(N)n(n1)-c1ccccn1)N1CCOCC1
: