Target
Serine/threonine-protein kinase Nek3
Ligand
BDBM50355497
Substrate
Meas. Tech.
ChEMBL_774350 (CHEMBL1908567)
Kd
>10000±n/a nM
Citation
 Davis, MIHunt, JPHerrgard, SCiceri, PWodicka, LMPallares, GHocker, MTreiber, DKZarrinkar, PP Comprehensive analysis of kinase inhibitor selectivity. Nat Biotechnol 29:1046-51 (2011)  
Target
Name:
Serine/threonine-protein kinase Nek3
Synonyms:
NEK3 | NEK3_HUMAN
Type:
PROTEIN
Mol. Mass.:
57709.05
Organism:
Homo sapiens (Human)
Description:
ChEMBL_774350
Residue:
506
  
Inhibitor
Name:
BDBM50355497
Synonyms:
AZD-6244 | CHEMBL1614701
Type:
Small organic molecule
Emp. Form.:
C17H15BrClFN4O3
Mol. Mass.:
457.681
SMILES:
Cn1cnc2c(F)c(Nc3ccc(Br)cc3Cl)c(cc12)C(=O)NOCCO
: