Target
Mitogen-activated protein kinase kinase kinase 13
Ligand
BDBM50355497
Substrate
Meas. Tech.
ChEMBL_774445 (CHEMBL1908662)
Kd
>10000±n/a nM
Citation
 Davis, MIHunt, JPHerrgard, SCiceri, PWodicka, LMPallares, GHocker, MTreiber, DKZarrinkar, PP Comprehensive analysis of kinase inhibitor selectivity. Nat Biotechnol 29:1046-51 (2011)  
Target
Name:
Mitogen-activated protein kinase kinase kinase 13
Synonyms:
LZK M3K13_HUMAN MLK | Mixed lineage kinase
Type:
PROTEIN
Mol. Mass.:
108293.85
Organism:
Homo sapiens (Human)
Description:
ChEMBL_774445
Residue:
966
  
Inhibitor
Name:
BDBM50355497
Synonyms:
AZD-6244 | CHEMBL1614701
Type:
Small organic molecule
Emp. Form.:
C17H15BrClFN4O3
Mol. Mass.:
457.681
SMILES:
Cn1cnc2c(F)c(Nc3ccc(Br)cc3Cl)c(cc12)C(=O)NOCCO
: