Target
Alpha-1A adrenergic receptor
Ligand
BDBM50035513
Substrate
Meas. Tech.
ChEMBL_775010 (CHEMBL1912165)
Ki
151±n/a nM
Citation
 Al Hussainy, RVerbeek, Jvan der Born, DBooij, JHerscheid, JK Design, synthesis and in vitro evaluation of bridgehead fluoromethyl analogs of N-{2-[4-(2-methoxyphenyl)piperazin-1-yl]ethyl}-N-(pyridin-2-yl)cyclohexanecarboxamide (WAY-100635) for the 5-HT(1A) receptor. Eur J Med Chem 46:5728-35 (2011)  
Target
Name:
Alpha-1A adrenergic receptor
Synonyms:
ADA1A_HUMAN ADRA1C Alpha 1A-adrenoceptor Alpha adrenergic receptor 1a Alpha-adrenergic receptor 1c adrenergic Alpha1 | adrenergic Alpha1C
Type:
Cell-surface receptors
Mol. Mass.:
51511.67
Organism:
Homo sapiens (Human)
Description:
P35348
Residue:
466
  
Inhibitor
Name:
BDBM50035513
Synonyms:
4-Fluoro-N-{2-[4-(2-methoxy-phenyl)-piperazin-1-yl]-ethyl}-N-pyridin-2-yl-benzamide CHEMBL286607
Type:
Small organic molecule
Emp. Form.:
C25H27FN4O2
Mol. Mass.:
434.5059
SMILES:
COc1ccccc1N1CCN(CCN(C(=O)c2ccc(F)cc2)c2ccccn2)CC1
: