Target
Telomerase reverse transcriptase
Ligand
BDBM50357372
Substrate
Meas. Tech.
ChEMBL_787845 (CHEMBL1918611)
IC50
5040±n/a nM
Citation
 Zhang, XMQiu, MSun, JZhang, YBYang, YSWang, XLTang, JFZhu, HL Synthesis, biological evaluation, and molecular docking studies of 1,3,4-oxadiazole derivatives possessing 1,4-benzodioxan moiety as potential anticancer agents. Bioorg Med Chem 19:6518-24 (2011)  
Target
Name:
Telomerase reverse transcriptase
Synonyms:
EST2 TERT TRT
Type:
PROTEIN
Mol. Mass.:
127099.03
Organism:
Homo sapiens (Human)
Description:
ChEMBL_1447029
Residue:
1132
  
Inhibitor
Name:
BDBM50357372
Synonyms:
CHEMBL1917263
Type:
Small organic molecule
Emp. Form.:
C18H16N2O3S
Mol. Mass.:
340.396
SMILES:
Cc1ccc(CSc2nnc(o2)-c2ccc3OCCOc3c2)cc1
: