Target
Type 1 fimbrin D-mannose specific adhesin
Ligand
BDBM50357401
Substrate
Meas. Tech.
ChEMBL_788106 (CHEMBL1919133)
IC50
348±n/a nM
Citation
 Schwardt, ORabbani, SHartmann, MAbgottspon, DWittwer, MKleeb, SZalewski, ASmieško, MCutting, BErnst, B Design, synthesis and biological evaluation of mannosyl triazoles as FimH antagonists. Bioorg Med Chem 19:6454-73 (2011)  
Target
Name:
Type 1 fimbrin D-mannose specific adhesin
Synonyms:
Adhesin protein fimH fimH
Type:
PROTEIN
Mol. Mass.:
31474.61
Organism:
Escherichia coli (strain K12)
Description:
ChEMBL_1298296
Residue:
300
  
Inhibitor
Name:
BDBM50357401
Synonyms:
CHEMBL1917470
Type:
Small organic molecule
Emp. Form.:
C15H18FN3O6
Mol. Mass.:
355.3183
SMILES:
OC[C@H]1O[C@H](OCc2cn(nn2)-c2cccc(F)c2)[C@@H](O)[C@@H](O)[C@@H]1O
: