Target
Mineralocorticoid receptor
Ligand
BDBM50228080
Substrate
Meas. Tech.
ChEMBL_792910 (CHEMBL1929756)
IC50
49±n/a nM
Citation
 Hasui, TMatsunaga, NOra, TOhyabu, NNishigaki, NImura, YIgata, YMatsui, HMotoyaji, TTanaka, THabuka, NSogabe, SOno, MSiedem, CSTang, TPGauthier, CDe Meese, LABoyd, SAFukumoto, S Identification of benzoxazin-3-one derivatives as novel, potent, and selective nonsteroidal mineralocorticoid receptor antagonists. J Med Chem 54:8616-31 (2011)  
Target
Name:
Mineralocorticoid receptor
Synonyms:
MCR MLR NR3C2 | Nuclear receptor subfamily 3 group C member 2
Type:
Enzyme
Mol. Mass.:
107076.42
Organism:
Homo sapiens (Human)
Description:
P08235
Residue:
984
  
Inhibitor
Name:
BDBM50228080
Synonyms:
2',15'-dimethyl-5,5'-dioxo-(9'R)-spiro[tetrahydrofuran-2,14'-tetracyclo[8.7.0.02,7.011,15]heptadec-6'-ene]-9-yl ethanethioate 2',15'-dimethyl-5,5'-dioxospiro[tetrahydrofuran-2,14'-tetracyclo[8.7.0.02,7.011,15]heptadec-6'-ene]-9-yl ethanethioate(Spiranolactone) CHEMBL1393 SPIRONOLACTONE cid_5833
Type:
Small organic molecule
Emp. Form.:
C24H32O4S
Mol. Mass.:
416.573
SMILES:
CC(=O)S[C@@H]1CC2=CC(=O)CC[C@]2(C)[C@H]2CC[C@@]3(C)[C@@H](CC[C@@]33CCC(=O)O3)[C@H]12
: