Target
D(2) dopamine receptor
Ligand
BDBM50359962
Substrate
Meas. Tech.
ChEMBL_791370 (CHEMBL1930141)
Ki
>10000±n/a nM
Citation
 Fiorino, FSeverino, BMagli, EPerissutti, EFrecentese, FEsposito, AIncisivo, GMCiano, AMassarelli, PNencini, CSantagada, VCaliendo, G New potent 5-HT(2A) receptor ligands containing an N'-cyanopicolinamidine nucleus: Synthesis and in vitro pharmacological evaluation. Eur J Med Chem 47:520-9 (2012)  
Target
Name:
D(2) dopamine receptor
Synonyms:
DOPAMINE D2 DOPAMINE D2 Short Dopamine D2 receptor Drd2
Type:
G Protein-Coupled Receptor (GPCR)
Mol. Mass.:
50931.60
Organism:
Rattus norvegicus (rat)
Description:
P61169
Residue:
444
  
Inhibitor
Name:
BDBM50359962
Synonyms:
CHEMBL1927096
Type:
Small organic molecule
Emp. Form.:
C18H22N8
Mol. Mass.:
350.4209
SMILES:
N#CNC(=NCCCN1CCN(CC1)c1ncccn1)c1ccccn1
: