Target
MAP kinase-activated protein kinase 2
Ligand
BDBM50360557
Substrate
Meas. Tech.
ChEMBL_795360 (CHEMBL1937260)
EC50
4.2±n/a nM
Citation
 Oubrie, AKaptein, Ade Zwart, EHoogenboom, NGoorden, Rvan de Kar, Bvan Hoek, Mde Kimpe, Vvan der Heijden, RBorsboom, JKazemier, Bde Roos, JScheffers, MLommerse, JSchultz-Fademrecht, CBarf, T Novel ATP competitive MK2 inhibitors with potent biochemical and cell-based activity throughout the series. Bioorg Med Chem Lett 22:613-8 (2011)  
Target
Name:
MAP kinase-activated protein kinase 2
Synonyms:
MAP kinase-activated protein kinase 2 (MAPKAPK2) MAP kinase-activated protein kinase 2 (p38/MK2) MAPK-activated protein kinase 2 MAPKAP kinase 2 MAPKAPK2 | MK2
Type:
Serine/threonine-protein kinase
Mol. Mass.:
45579.87
Organism:
Homo sapiens (Human)
Description:
P49137
Residue:
400
  
Inhibitor
Name:
BDBM50360557
Synonyms:
CHEMBL1933185
Type:
Small organic molecule
Emp. Form.:
C22H22N6O2
Mol. Mass.:
402.4491
SMILES:
O=C(Nc1cc(ccn1)-c1cc2c([nH]1)C1(CCCNC1)CNC2=O)c1ccccn1
: