Target
Beta-secretase 1
Ligand
BDBM50361392
Substrate
Meas. Tech.
ChEMBL_795222 (CHEMBL1936881)
IC50
>500000±n/a nM
Citation
 Marumoto, SMiyazawa, M Structure-activity relationships for naturally occurring coumarins asß-secretase inhibitor. Bioorg Med Chem 20:784-8 (2012)  
Target
Name:
Beta-secretase 1
Synonyms:
ASP2 Aspartyl protease 2 BACE1 Beta-secretase (BACE) Beta-secretase 1 (BACE 1) Beta-secretase 1 (BACE1) Beta-site amyloid precursor protein cleaving enzyme 1 Memapsin-2 beta-Secretase (BACE-1) | beta-Secretase (BACE1)
Type:
Protein
Mol. Mass.:
55755.10
Organism:
Homo sapiens (Human)
Description:
P56817
Residue:
501
  
Inhibitor
Name:
BDBM50361392
Synonyms:
CHEMBL1710181
Type:
Small organic molecule
Emp. Form.:
C21H22O5
Mol. Mass.:
354.3964
SMILES:
[#6]\[#6](-[#6])=[#6]\[#6]-[#8]-c1c2ccoc2c(-[#8]-[#6]\[#6]=[#6](\[#6])-[#6])c2oc(=O)ccc12
: