Target
Carbonic anhydrase 1
Ligand
BDBM7
Substrate
Meas. Tech.
ChEMBL_801485 (CHEMBL1948412)
Ki
8610±n/a nM
Citation
 Balaydin, HTSentürk, MMenzek, A Synthesis and carbonic anhydrase inhibitory properties of novel cyclohexanonyl bromophenol derivatives. Bioorg Med Chem Lett 22:1352-7 (2012)  
Target
Name:
Carbonic anhydrase 1
Synonyms:
CA-I CAB Carbonate dehydratase I Carbonic anhydrase 1 (CA I) Carbonic anhydrase 1 (Recombinant CA I) Carbonic anhydrase B Carbonic anhydrase I (CA I) Carbonic anhydrase I (CAI) Carbonic anhydrase isoenzyme I (hCA I) | hCA
Type:
Enzyme
Mol. Mass.:
28873.37
Organism:
Homo sapiens (Human)
Description:
P00915
Residue:
261
  
Inhibitor
Name:
BDBM7
Synonyms:
2-methylcyclohexan-1-one | 2-methylcyclohexanone
Type:
Small organic molecule
Emp. Form.:
C7H12O
Mol. Mass.:
112.1696
SMILES:
CC1CCCCC1=O
: