Target
Dual specificity tyrosine-phosphorylation-regulated kinase 1A
Ligand
BDBM50363797
Substrate
Meas. Tech.
ChEMBL_802019 (CHEMBL1949177)
IC50
67±n/a nM
Citation
 Neagoie, CVedrenne, EBuron, FMérour, JYRosca, SBourg, SLozach, OMeijer, LBaldeyrou, BLansiaux, ARoutier, S Synthesis of chromeno[3,4-b]indoles as Lamellarin D analogues: a novel DYRK1A inhibitor class. Eur J Med Chem 49:379-96 (2012)  
Target
Name:
Dual specificity tyrosine-phosphorylation-regulated kinase 1A
Synonyms:
DYR1A_RAT Dual-specificity tyrosine-(Y)-phosphorylation regulated kinase 1A Dyrk1a
Type:
Enzyme Catalytic Domain
Mol. Mass.:
85573.59
Organism:
RAT
Description:
Dual-specificity tyrosine-(Y)-phosphorylation regulated kinase 1A 0 RAT::Q63470
Residue:
763
  
Inhibitor
Name:
BDBM50363797
Synonyms:
CHEMBL1947110
Type:
Small organic molecule
Emp. Form.:
C15H9NO4
Mol. Mass.:
267.2363
SMILES:
Oc1ccc2[nH]c3c(c2c1)c1cc(O)ccc1oc3=O
: