Target
cAMP and cAMP-inhibited cGMP 3',5'-cyclic phosphodiesterase 10A
Ligand
BDBM50364335
Substrate
Meas. Tech.
ChEMBL_804822 (CHEMBL1953641)
Ki
0.4±n/a nM
Citation
 McElroy, WTTan, ZBasu, KYang, SWSmotryski, JHo, GDTulshian, DGreenlee, WJMullins, DGuzzi, MZhang, XBleickardt, CHodgson, R Pyrazoloquinolines as PDE10A inhibitors: discovery of a tool compound. Bioorg Med Chem Lett 22:1335-9 (2012)  
Target
Name:
cAMP and cAMP-inhibited cGMP 3',5'-cyclic phosphodiesterase 10A
Synonyms:
3',5'-cyclic phosphodiesterase PDE10_HUMAN Phosphodiesterase 10A
Type:
Protein
Mol. Mass.:
88412.52
Organism:
Homo sapiens (Human)
Description:
Q9Y233
Residue:
779
  
Inhibitor
Name:
BDBM50364335
Synonyms:
CHEMBL1950089
Type:
Small organic molecule
Emp. Form.:
C16H13ClN4O2
Mol. Mass.:
328.753
SMILES:
Cc1n[nH]c2nc3c(C)cc(Cl)cc3c(C(O)c3ncco3)c12
: