Target
Potassium voltage-gated channel subfamily H member 2
Ligand
BDBM50364947
Substrate
Meas. Tech.
ChEMBL_804280 (CHEMBL1954425)
IC50
18000±n/a nM
Citation
 Cheng, YXPourashraf, MLuo, XSrivastava, SWalpole, CSalois, DSt-Onge, SPayza, KLessard, EYu, XHTomaszewski, MJ ¿-Carbolines: a novel class of cannabinoid agonists with high aqueous solubility and restricted CNS penetration. Bioorg Med Chem Lett 22:1619-24 (2012)  
Target
Name:
Potassium voltage-gated channel subfamily H member 2
Synonyms:
1,3-beta-glucan synthase component GLS2 ERG Eag-related protein 1 Ether-a-go-go-related gene (HERG) Ether-a-go-go-related gene potassium channel 1 Ether-a-go-go-related gene potassium channel 1 (hERG1) Ether-a-go-go-related protein 1 H-ERG KCNH2 Potassium voltage-gated channel subfamily H member 2 (hERG) Voltage-gated potassium channel subunit Kv11.1 hERG Potassium Channel 1 | putative potassium channel subunit
Type:
Multi-pass membrane protein
Mol. Mass.:
126672.65
Organism:
Homo sapiens (Human)
Description:
Q12809
Residue:
1159
  
Inhibitor
Name:
BDBM50364947
Synonyms:
CHEMBL1950490
Type:
Small organic molecule
Emp. Form.:
C23H31N3O2
Mol. Mass.:
381.5111
SMILES:
Cn1c2CCN(Cc2c2cc(ccc12)C(=O)N1CCCCC1)C1CCOCC1
: