Target
Eukaryotic translation initiation factor 4E
Ligand
BDBM50294220
Substrate
Meas. Tech.
ChEMBL_804895 (CHEMBL1953943)
IC50
>20000±n/a nM
Citation
 Rydzik, AMKulis, MLukaszewicz, MKowalska, JZuberek, JDarzynkiewicz, ZMDarzynkiewicz, EJemielity, J Synthesis and properties of mRNA cap analogs containing imidodiphosphate moiety--fairly mimicking natural cap structure, yet resistant to enzymatic hydrolysis. Bioorg Med Chem 20:1699-710 (2012)  
Target
Name:
Eukaryotic translation initiation factor 4E
Synonyms:
EIF4E | IF4E_RABIT
Type:
PROTEIN
Mol. Mass.:
25047.40
Organism:
Oryctolagus cuniculus
Description:
ChEMBL_1511842
Residue:
217
  
Inhibitor
Name:
BDBM50294220
Synonyms:
2-amino-9-[(2R,3R,4S,5R)-5-{[({[({[(2R,3S,4R,5R)-5-(2-amino-6-oxo-6,9-dihydro-1H-purin-9-yl)-3,4-dihydroxyoxolan-2-yl]methyl phosphonato}oxy)phosphinato]oxy}phosphinato)oxy]methyl}-3,4-dihydroxyoxolan-2-yl]-7-methyl-6-oxido-9H-purin-7-ium | CHEMBL555899
Type:
Small organic molecule
Emp. Form.:
C21H26N10O18P3
Mol. Mass.:
799.4103
SMILES:
C[n+]1cn([C@@H]2O[C@H](COP([O-])(=O)OP([O-])(=O)OP([O-])(=O)OC[C@H]3O[C@H]([C@H](O)[C@@H]3O)n3cnc4c3nc(N)[nH]c4=O)[C@@H](O)[C@H]2O)c2nc(N)[n-]c(=O)c12
: